{"text_format":"1","workbook":"xlsx","n_sheets":11,"sheets":["INSTRUCTIONS","Header","misc. entries","Mileage","Per Diems","Form Front","Form Back","Extension","In State","Out of State","Sheet1"],"not_rendered":{"charts":0,"images":7,"macros":1,"external_links":0,"defined_names":10,"comments":1,"pivot_tables":0},"unopened":[],"bounds":{"document_bytes":16777216,"sheet_cells":100000,"rows_first":2000,"rows_last":500,"rows_between":2000,"halvings":0,"cell_chars":16384,"cell_head_chars":4096},"cells_cut":0,"cells_raw":0,"read":"whole","date_system":"1900"}

{"sheet":"INSTRUCTIONS","index":0,"n_rows":87,"n_cols":11,"rows_kept":87,"cut":false,"hidden":false,"merged":[[18,7,18,10]]}
[]
[null,"EMPLOYEE TRAVEL REIMBURSEMENT"]
[]
["Set Up:","For First Time users only."]
[]
[null,"Step 1","Before doing anything else, click on Enable Content ribbon at top of sheet if it appears for you."]
[]
[null,"Step 2","Fill out the Header Page. (Click on Page Marked \"Header\" along bottom of Spreadsheet)"]
[]
[]
{"$rows_left_out":78}
{"sheet":"Header","index":1,"n_rows":35,"n_cols":7,"rows_kept":35,"cut":false,"hidden":false,"merged":[[20,5,20,8],[20,0,20,3],[21,0,21,3],[21,5,21,8],[35,5,35,8],[34,5,34,8],[26,0,26,3],[28,0,28,3],[30,0,30,3],[17,0,17,4],[17,6,17,9],[32,0,32,3],[34,0,34,3],[26,5,26,8],[28,5,28,8],[30,5,30,8],[32,5,32,8],[23,5,23,8],[24,5,24,8],[24,0,24,3],[23,0,23,3],[19,0,19,3],[19,5,19,8],[22,0,22,3],[22,5,22,8],[11,1,11,2],[6,1,6,2],[9,1,9,2],[10,1,10,2],[2,1,2,5],[3,1,3,5],[4,1,4,5],[5,1,5,5],[10,3,11,14]]}
[]
[null,"HEADER INFORMATION"]
["Name:"]
["Worksite:"]
["Department:","HSA"]
["Phone:"]
["Employee number:",null,null,"(6 digit number starting with 00 found on timecard and pay slip)"]
[null,null,null,"Enter  last four  digits (five if necessary) only including leading zero if appropriate - "]
[null,null,null,"(numbers beginning with zero must be preceded by an apostrophe)"]
["GL Key"]
{"$rows_left_out":26}
{"sheet":"misc. entries","index":2,"n_rows":23,"n_cols":29,"rows_kept":23,"cut":false,"hidden":false,"merged":[[2,26,2,31],[4,26,4,31],[6,26,6,31],[8,26,8,31],[2,5,2,10],[4,5,4,10],[6,5,6,10],[8,5,8,10],[16,1,16,2],[19,22,19,23],[10,26,10,28],[12,26,12,31],[14,26,14,31],[16,26,16,29],[19,1,19,2],[10,5,10,7],[19,5,19,9],[16,5,16,8],[12,5,12,10],[14,5,14,10]]}
["MISCELLANEOUS ENTRIES - Enter amount in appropriate square",null,null,null,null,null,null,null,null,null,null,null,null,null,null,null,null,"Subobject",null,null,null,"MISCELLANEOUS ENTRIES "]
[]
[62928,"Air Fare",null,null,null,"Provide receipt and canceled check or Credit Card Receipt",null,null,null,null,null,null,null,null,null,null,null,4150,null,null,null,62928,"Air Fare",null,{"$f":"+D3","v":0}]
[]
[62928,"Airport Shuttle",null,null,null,"Provide receipt and canceled check or Credit Card Receipt",null,null,null,null,null,null,null,null,null,null,null,4168,null,null,null,62928,"Airport Shuttle",null,{"$f":"+D5","v":0}]
[]
[62928,"Auto Rental",null,null,null,"Provide receipt and canceled check or Credit Card Receipt-requires prior approval",null,null,null,null,null,null,null,null,null,null,null,4152,null,null,null,62928,"Auto Rental",null,{"$f":"+D7","v":0}]
[]
[62928,"Gas, Oil, Fuel",null,null,null,"Use only for rental car or County car. Fuel is included in mileage for personal vehicles",null,null,null,null,null,null,null,null,null,null,null,4160,null,null,null,62928,"Gas, Oil, Fuel",null,{"$f":"+D9","v":0}]
[]
{"$rows_left_out":14}
{"sheet":"Mileage","index":3,"n_rows":52,"n_cols":10,"rows_kept":52,"cut":false,"hidden":false,"merged":[[1,0,1,7]]}
[]
["ENTER DAILY MILEAGE HERE.  You have 46 lines.  If you require additional space, submit a separate claim.  Try to keep in date order.  Try to start and end with the beginning or end of the month.   If you do not have your odometer or trip meter readings, enter total miles in END column.  They will be checked against the charts.  "]
["Caution:  Do Not print this page to go with your claim. Please Print \"Form Back\" and \"Extension\" (if required).",null,null,null,null,null,null,null,null,"For JL Key 1 enter 1"]
[null,null,null,null,null,null,null,null,null,"For JL Key 2 enter 2 "]
["DATE","TIME","ORIGIN","DESTINATION","PURPOSE OF TRIP","END","START","MILES CLAIMED",null,"JL Key"]
[null,null,null,null,null,null,null,{"$f":"+F6-G6","v":0}]
[null,null,null,null,null,null,null,{"$f":"+F7-G7","v":0}]
[null,null,null,null,null,null,null,0]
[null,null,null,null,null,null,null,0]
[null,null,null,null,null,null,null,0]
{"$rows_left_out":43}
{"sheet":"Per Diems","index":4,"n_rows":31,"n_cols":38,"rows_kept":31,"cut":false,"hidden":false,"merged":[[30,2,30,7],[5,9,5,13],[16,1,16,5],[6,9,6,13],[23,9,23,15],[25,9,25,15],[26,9,26,15],[15,1,15,8],[1,4,4,17],[29,9,29,15],[6,14,6,18],[27,9,27,15],[19,1,19,4]]}
[null,"Select the County of Travel and Dates and Times of Travel"]
[null,"In State Travel",null,null,"Note: Use drop downs to populate In State or Out of State City/County of Travel. Please look up per diem rates by clicking on Federal Per Diem Rate Look up link below. Key in rates for requested meal and lodging per diems into grid at bottom. See instructions tab for more detail regarding per diems.",null,null,null,null,null,null,null,null,null,null,null,null,null,null,null,null,null,null,"State/City",null,null,"CO-CITY"]
[null,null,null,null,null,null,null,null,null,null,null,null,null,null,null,null,null,null,null,null,null,null,null,"   --  ",null,null,"    --  ",null,null,null,null,null,{"$f":"+B8","v":"00:00:00"},{"$f":"HOUR(B12)","v":0},{"$f":"MINUTE(B12)","v":0},null,null,{"$f":"TIME(AH3,AI3,0)","v":"00:00:00"}]
[null,null,null,null,null,null,null,null,null,null,null,null,null,null,null,null,null,null,null,null,null,null,null,null,null,null,null,null,"IN STATE",null,"Out of State"]
[null,"Out of State Travel",null,null,null,null,null,null,null,null,null,null,null,null,null,null,null,null,null,null,null,null,null,null,null,null,null,null,"Hotel",null,null,null,{"$f":"+B10","v":"00:00:00"},{"$f":"HOUR(B14)","v":0},{"$f":"MINUTE(B14)","v":0},"PM",{"$f":"LEFT(AJ5,1)","v":"P"},{"$f":"TIME(IF(+AK5=\"p\",+AH5,+AH5),AI5,0)","v":"00:00:00"}]
[null,null,null,null,null,null,null,null,null,null,null,null,null,null,null,null,null,null,null,null,null,null,null,null,null,null,null,null,"W/tax_rate",null,"Pre-tax_rate"]
[null,"Departure Date",null,null,null,null,null,null,null,"Federal Per Diem Rate Look Up:",null,null,null,null,"http://www.gsa.gov/portal/content/104877",null,null,null,null,null,null,null,null,null,null,null,"Per Deim Rates",null,{"$f":"VLOOKUP(AA3,PDS,6)","v":0},null,{"$f":"VLOOKUP($X$3,OOS,4)","v":0},null,null,null,null,null,"06:00:00"]
[null,null,"  ( Format 00/00, month and date)",null,null,null,null,null,null,null,null,null,null,null,null,null,null,null,null,null,null,null,null,null,null,null,null,null,null,null,null,null,null,null,null,null,"11:00:00"]
[null,"Return Date",null,null,null,null,null,null,null,null,null,null,null,null,null,null,null,null,null,null,null,null,null,null,null,null,null,"Day 1","Day 2","Day 3","Day 4","Day 5","Day 6",null,null,null,"19:00:00"]
[null,null,"  ( Format 00/00, month and date)",null,null,null,null,null,null,null,null,null,null,null,null,null,null,null,null,null,null,null,null,null,null,null,null,{"$f":"+$B$8","v":"00:00:00"},{"$f":"IF($B$10>$B$8,$B$8+1,0)","v":"00:00:00"},{"$f":"IF($B$10=$B$8+1,0,IF($B$10>$B$8+1,$B$8+2,0))","v":"00:00:00"},{"$f":"IF($B$10=$B$8+2,0,IF($B$10>$B$8+2,$B$8+3,0))","v":"00:00:00"},{"$f":"IF($B$10=$B$8+3,0,IF($B$10>$B$8+3,$B$8+4,0))","v":"00:00:00"},{"$f":"IF($B$10=$B$8+4,0,IF($B$10>$B$8+4,$B$8+5,0))","v":"00:00:00"}]
{"$rows_left_out":22}
{"sheet":"Form Front","index":5,"n_rows":43,"n_cols":19,"rows_kept":43,"cut":false,"hidden":false,"merged":[[37,14,39,17],[37,18,39,18],[24,18,25,18],[24,14,25,17],[26,14,29,17],[30,14,32,17],[26,18,29,18],[30,18,32,18],[33,14,34,17],[33,18,34,18],[35,14,36,17],[35,18,36,18],[31,3,32,4],[33,3,33,4],[29,3,30,4],[31,5,32,6],[25,5,25,6],[26,7,28,8],[26,0,28,2],[36,7,36,8],[26,3,28,4],[29,5,30,6],[29,0,30,2],[34,3,35,4],[23,0,24,2],[21,0,22,2],[19,14,21,18],[23,14,23,18],[21,9,22,10],[29,12,30,13],[29,9,30,10],[23,3,24,4],[20,5,20,6],[23,12,24,13],[19,12,19,13],[19,0,19,2],[18,3,18,13],[14,15,14,18],[14,7,14,10],[14,5,14,6],[16,3,16,4],[14,3,14,4],[15,3,15,13],[20,3,20,4],[20,9,20,10],[19,5,19,6],[19,9,19,10],[16,11,16,13],[9,1,9,2],[11,1,11,2],[12,1,12,2],[13,1,13,2],[1,13,2,14],[1,15,2,18],[3,15,3,18],[4,15,5,16],[7,15,7,16],[4,17,5,17],[4,18,5,18],[10,17,10,18],[11,3,11,4],[4,3,4,4],[9,5,9,6],[2,2,2,4],[11,5,11,6],[11,11,11,13],[13,11,13,13],[4,13,5,14],[1,1,1,4],[3,13,3,14],[10,11,10,13],[7,13,7,14],[9,7,9,10],[12,3,12,4],[16,5,16,6],[16,7,16,10],[17,3,17,13],[13,3,13,4],[9,3,9,4],[10,3,10,4],[11,7,11,10],[39,7,39,8],[36,9,36,10],[36,12,37,13],[33,12,35,13],[34,11,35,11],[37,9,38,10],[37,11,38,11],[37,5,38,6],[37,7,38,8],[34,7,35,8],[36,5,36,6],[34,5,35,6],[37,3,38,4],[20,12,20,13],[39,5,39,6],[26,12,28,13],[33,7,33,8],[29,11,30,11],[29,7,30,8],[31,7,32,8],[20,7,20,8],[34,9,35,10],[31,9,32,10],[23,11,24,11],[36,3,36,4],[31,11,32,11],[31,12,32,13],[23,7,24,8],[25,9,25,10],[21,7,22,8],[33,5,33,6],[26,5,28,6],[33,9,33,10],[21,12,22,13],[38,12,39,13],[39,9,39,10],[40,0,40,1],[36,0,36,2],[39,0,39,2],[31,0,32,2],[34,0,35,2],[37,0,38,2],[33,0,33,2],[12,11,12,13],[19,7,19,8],[25,0,25,2],[18,1,18,2],[21,3,22,4],[20,0,20,2],[21,5,22,6],[25,3,25,4],[21,11,22,11],[25,7,25,8],[26,11,28,11],[26,9,28,10],[25,12,25,13],[23,9,24,10],[23,5,24,6],[39,3,39,4],[14,11,14,13],[1,5,2,11],[3,2,3,4],[3,0,3,1],[19,3,19,4],[16,1,16,2],[14,1,14,2],[10,1,10,2],[12,5,12,6],[13,5,13,6],[15,1,15,2],[17,1,17,2],[5,0,5,1],[5,3,5,6],[5,8,5,9],[8,0,8,2],[12,7,12,10],[13,7,13,10],[7,0,7,1],[7,3,7,6],[7,8,7,9],[10,5,10,6],[8,3,8,13],[9,11,9,13],[10,7,10,10]]}
[]
[null,"THIS BOX FOR AUDITOR'S USE ONLY              ",null,null,null,"COUNTY OF SANTA CRUZ",null,null,null,null,null,null,null,"CLAIMANT",null,{"$f":"+Header!B3","v":0}]
["    VOUCHER NUMBER",null,"PAYMENT DATE"]
[null,null,null,null,null,null,null,null,"TRAVEL REIMBURSEMENT",null,null,null,null,"WORKSITE",null,{"$f":"+Header!B4","v":0}]
[null,null,null,null,null,null,null,null,null,null,null,null,null,"DEPT",null,{"$f":"+Header!B5","v":"HSA"},null,"PHONE",{"$f":"+Header!B6","v":0}]
["VENDOR NUMBER / SUFFIX",null,"1 CK","DOCUMENT AMOUNT **",null,null,null,"LNS","T/C HASH"]
[null,null,null,null,null,null,null,null,null,null,null,null,null,null,null,null,null,"PHONE"]
[{"$f":"IF(LEN(Header!B7)=4,CONCATENATE(60,Header!B7,\"     \",\"(tab)  01\"),IF(LEN(Header!B7)=5,CONCATENATE(6,Header!B7,\"     \",\"(tab)  01\"),\"\"))","v":""},null,null,{"$f":"+B18","v":0},null,null,null,{"$f":"COUNT(D11:E17,B17)-1","v":0},{"$f":"+H8*150+(IF(B17=0,0,49))","v":0},null,null,null,null,"Reviewed By",null,null,null,"PHONE"]
["DESCRIPTION - INDICATE MONTH                      (& purpose) OF TRAVEL >>>>>",null,null,{"$f":"INSTRUCTIONS!H19","v":0}]
["T/C","AMOUNT",null,"GL KEY",null,"GL OBJECT",null,"JL KEY",null,null,null,"DOC REF",null,null,"     GL OBJECT TITLE:"]
{"$rows_left_out":34}
{"sheet":"Form Back","index":6,"n_rows":45,"n_cols":15,"rows_kept":45,"cut":false,"hidden":false,"merged":[[6,10,6,11],[15,10,15,11],[13,10,13,11],[14,10,14,11],[7,10,7,11],[8,10,8,11],[16,7,16,8],[9,10,9,11],[16,10,16,11],[11,10,11,11],[12,10,12,11],[10,10,10,11],[9,7,9,8],[10,3,10,4],[14,5,14,6],[16,3,16,4],[8,7,8,8],[10,7,10,8],[14,3,14,4],[13,7,13,8],[15,5,15,6],[8,5,8,6],[12,7,12,8],[10,5,10,6],[14,7,14,8],[15,7,15,8],[11,7,11,8],[11,5,11,6],[16,5,16,6],[0,3,0,4],[2,3,2,4],[3,3,3,4],[8,3,8,4],[4,3,4,4],[5,3,5,4],[6,3,6,4],[7,3,7,4],[1,3,1,4],[6,7,6,8],[7,7,7,8],[9,3,9,4],[6,5,6,6],[7,5,7,6],[9,5,9,6],[19,3,19,4],[11,3,11,4],[18,5,18,6],[12,5,12,6],[13,5,13,6],[15,3,15,4],[17,3,17,4],[13,3,13,4],[18,3,18,4],[12,3,12,4],[19,5,19,6],[17,5,17,6],[18,10,18,11],[17,10,17,11],[28,7,29,9],[28,10,29,11],[19,7,19,8],[19,10,19,11],[26,10,26,11],[21,10,21,11],[23,10,23,11],[24,10,24,11],[18,7,18,8],[17,7,17,8],[5,10,5,11],[0,10,1,11],[0,5,1,6],[3,10,3,11],[4,10,4,11],[0,7,0,9],[1,7,1,8],[2,7,2,8],[3,7,3,8],[4,5,4,6],[2,5,2,6],[3,5,3,6],[2,10,2,11],[5,5,5,6],[4,7,4,8],[5,7,5,8]]}
[null,null,null,null,null,"PURPOSE OF TRIP",null,"ODOMETER",null,null,"MILES CLAIMED"]
["DATE","TIME","ORIGIN","DESTINATION",null,null,null,"END",null,"START",null,null,null,"JL Key"]
[{"$f":"+Mileage!A6","v":"00:00:00"},{"$f":"+Mileage!B6","v":"00:00:00"},{"$f":"+Mileage!C6","v":0},{"$f":"+Mileage!D6","v":0},null,{"$f":"+Mileage!E6","v":0},null,{"$f":"+Mileage!F6","v":0},null,{"$f":"+Mileage!G6","v":0},{"$f":"+H3-J3","v":0},null,null,{"$f":"+Mileage!J6","v":0}]
[{"$f":"+Mileage!A7","v":"00:00:00"},{"$f":"+Mileage!B7","v":"00:00:00"},{"$f":"+Mileage!C7","v":0},{"$f":"+Mileage!D7","v":0},null,{"$f":"+Mileage!E7","v":0},null,{"$f":"+Mileage!F7","v":0},null,{"$f":"+Mileage!G7","v":0},{"$f":"+H4-J4","v":0},null,null,{"$f":"+Mileage!J7","v":0}]
[{"$f":"+Mileage!A8","v":"00:00:00"},{"$f":"+Mileage!B8","v":"00:00:00"},{"$f":"+Mileage!C8","v":0},{"$f":"+Mileage!D8","v":0},null,{"$f":"+Mileage!E8","v":0},null,{"$f":"+Mileage!F8","v":0},null,{"$f":"+Mileage!G8","v":0},0,null,null,{"$f":"+Mileage!J8","v":0}]
[{"$f":"+Mileage!A9","v":"00:00:00"},{"$f":"+Mileage!B9","v":"00:00:00"},{"$f":"+Mileage!C9","v":0},{"$f":"+Mileage!D9","v":0},null,{"$f":"+Mileage!E9","v":0},null,{"$f":"+Mileage!F9","v":0},null,{"$f":"+Mileage!G9","v":0},0,null,null,{"$f":"+Mileage!J9","v":0}]
[{"$f":"+Mileage!A10","v":"00:00:00"},{"$f":"+Mileage!B10","v":"00:00:00"},{"$f":"+Mileage!C10","v":0},{"$f":"+Mileage!D10","v":0},null,{"$f":"+Mileage!E10","v":0},null,{"$f":"+Mileage!F10","v":0},null,{"$f":"+Mileage!G10","v":0},0,null,null,{"$f":"+Mileage!J10","v":0}]
[{"$f":"+Mileage!A11","v":"00:00:00"},{"$f":"+Mileage!B11","v":"00:00:00"},{"$f":"+Mileage!C11","v":0},{"$f":"+Mileage!D11","v":0},null,{"$f":"+Mileage!E11","v":0},null,{"$f":"+Mileage!F11","v":0},null,{"$f":"+Mileage!G11","v":0},0,null,null,{"$f":"+Mileage!J11","v":0}]
[{"$f":"+Mileage!A12","v":"00:00:00"},{"$f":"+Mileage!B12","v":"00:00:00"},{"$f":"+Mileage!C12","v":0},{"$f":"+Mileage!D12","v":0},null,{"$f":"+Mileage!E12","v":0},null,{"$f":"+Mileage!F12","v":0},null,{"$f":"+Mileage!G12","v":0},0,null,null,{"$f":"+Mileage!J12","v":0}]
[{"$f":"+Mileage!A13","v":"00:00:00"},{"$f":"+Mileage!B13","v":"00:00:00"},{"$f":"+Mileage!C13","v":0},{"$f":"+Mileage!D13","v":0},null,{"$f":"+Mileage!E13","v":0},null,{"$f":"+Mileage!F13","v":0},null,{"$f":"+Mileage!G13","v":0},0,null,null,{"$f":"+Mileage!J13","v":0}]
{"$rows_left_out":36}
{"sheet":"Extension","index":7,"n_rows":36,"n_cols":14,"rows_kept":36,"cut":false,"hidden":false,"merged":[[0,3,0,4],[0,5,0,6],[0,7,0,9],[1,3,1,4],[1,5,1,6],[1,7,1,8],[4,5,4,6],[4,7,4,8],[6,5,6,6],[6,7,6,8],[9,5,9,6],[13,3,13,4],[13,5,13,6],[13,7,13,8],[0,10,1,11],[3,10,3,11],[4,10,4,11],[3,5,3,6],[5,10,5,11],[6,10,6,11],[9,7,9,8],[10,3,10,4],[10,5,10,6],[10,7,10,8],[3,7,3,8],[8,3,8,4],[8,5,8,6],[8,7,8,8],[5,5,5,6],[5,7,5,8],[7,5,7,6],[7,7,7,8],[7,10,7,11],[8,10,8,11],[13,10,13,11],[14,10,14,11],[15,10,15,11],[16,10,16,11],[9,10,9,11],[10,10,10,11],[11,10,11,11],[12,10,12,11],[14,3,14,4],[14,5,14,6],[14,7,14,8],[15,3,15,4],[15,5,15,6],[15,7,15,8],[16,3,16,4],[16,5,16,6],[16,7,16,8],[11,3,11,4],[11,5,11,6],[11,7,11,8],[12,3,12,4],[12,5,12,6],[12,7,12,8],[9,3,9,4],[17,10,17,11],[18,10,18,11],[19,3,19,4],[19,5,19,6],[19,7,19,8],[19,10,19,11],[18,3,18,4],[18,5,18,6],[18,7,18,8],[17,3,17,4],[17,5,17,6],[17,7,17,8],[22,3,22,4],[22,5,22,6],[22,7,22,8],[22,10,22,11],[20,10,20,11],[21,3,21,4],[21,5,21,6],[21,7,21,8],[21,10,21,11],[20,3,20,4],[20,5,20,6],[20,7,20,8],[29,7,29,8],[29,10,29,11],[24,3,24,4],[24,5,24,6],[24,7,24,8],[24,10,24,11],[23,3,23,4],[23,5,23,6],[23,7,23,8],[23,10,23,11],[26,3,26,4],[26,5,26,6],[26,7,26,8],[26,10,26,11],[25,3,25,4],[25,5,25,6],[25,7,25,8],[25,10,25,11],[33,10,33,11],[2,3,2,4],[2,5,2,6],[2,7,2,8],[2,10,2,11],[3,3,3,4],[4,3,4,4],[5,3,5,4],[6,3,6,4],[7,3,7,4],[28,3,28,4],[28,5,28,6],[28,7,28,8],[28,10,28,11],[27,3,27,4],[27,5,27,6],[27,7,27,8],[27,10,27,11],[30,3,30,4],[30,5,30,6],[30,7,30,8],[30,10,30,11],[29,3,29,4],[29,5,29,6]]}
[null,null,null,null,null,null,null,"ODOMETER",null,null,"MILES CLAIMED"]
["DATE","TIME","ORIGIN","DESTINATION",null,"PURPOSE OF TRIP",null,"END",null,"START",null,null,null,"code"]
[{"$f":"+Mileage!A24","v":"00:00:00"},{"$f":"+Mileage!B24","v":"00:00:00"},{"$f":"+Mileage!C24","v":0},{"$f":"+Mileage!D24","v":0},null,{"$f":"+Mileage!E24","v":0},null,{"$f":"+Mileage!F24","v":0},null,{"$f":"+Mileage!G24","v":0},{"$f":"+H3-J3","v":0},null,null,{"$f":"+Mileage!J24","v":0}]
[{"$f":"+Mileage!A25","v":"00:00:00"},{"$f":"+Mileage!B25","v":"00:00:00"},{"$f":"+Mileage!C25","v":0},{"$f":"+Mileage!D25","v":0},null,{"$f":"+Mileage!E25","v":0},null,{"$f":"+Mileage!F25","v":0},null,{"$f":"+Mileage!G25","v":0},{"$f":"+H4-J4","v":0},null,null,{"$f":"+Mileage!J25","v":0}]
[{"$f":"+Mileage!A26","v":"00:00:00"},{"$f":"+Mileage!B26","v":"00:00:00"},{"$f":"+Mileage!C26","v":0},{"$f":"+Mileage!D26","v":0},null,{"$f":"+Mileage!E26","v":0},null,{"$f":"+Mileage!F26","v":0},null,{"$f":"+Mileage!G26","v":0},0,null,null,{"$f":"+Mileage!J26","v":0}]
[{"$f":"+Mileage!A27","v":"00:00:00"},{"$f":"+Mileage!B27","v":"00:00:00"},{"$f":"+Mileage!C27","v":0},{"$f":"+Mileage!D27","v":0},null,{"$f":"+Mileage!E27","v":0},null,{"$f":"+Mileage!F27","v":0},null,{"$f":"+Mileage!G27","v":0},0,null,null,{"$f":"+Mileage!J27","v":0}]
[{"$f":"+Mileage!A28","v":"00:00:00"},{"$f":"+Mileage!B28","v":"00:00:00"},{"$f":"+Mileage!C28","v":0},{"$f":"+Mileage!D28","v":0},null,{"$f":"+Mileage!E28","v":0},null,{"$f":"+Mileage!F28","v":0},null,{"$f":"+Mileage!G28","v":0},0,null,null,{"$f":"+Mileage!J28","v":0}]
[{"$f":"+Mileage!A29","v":"00:00:00"},{"$f":"+Mileage!B29","v":"00:00:00"},{"$f":"+Mileage!C29","v":0},{"$f":"+Mileage!D29","v":0},null,{"$f":"+Mileage!E29","v":0},null,{"$f":"+Mileage!F29","v":0},null,{"$f":"+Mileage!G29","v":0},0,null,null,{"$f":"+Mileage!J29","v":0}]
[{"$f":"+Mileage!A30","v":"00:00:00"},{"$f":"+Mileage!B30","v":"00:00:00"},{"$f":"+Mileage!C30","v":0},{"$f":"+Mileage!D30","v":0},null,{"$f":"+Mileage!E30","v":0},null,{"$f":"+Mileage!F30","v":0},null,{"$f":"+Mileage!G30","v":0},0,null,null,{"$f":"+Mileage!J30","v":0}]
[{"$f":"+Mileage!A31","v":"00:00:00"},{"$f":"+Mileage!B31","v":"00:00:00"},{"$f":"+Mileage!C31","v":0},{"$f":"+Mileage!D31","v":0},null,{"$f":"+Mileage!E31","v":0},null,{"$f":"+Mileage!F31","v":0},null,{"$f":"+Mileage!G31","v":0},0,null,null,{"$f":"+Mileage!J31","v":0}]
{"$rows_left_out":27}
{"sheet":"In State","index":8,"n_rows":642,"n_cols":19,"rows_kept":642,"cut":false,"hidden":false,"merged":[]}
[]
[]
[]
[]
["CO-CITY","COUNTY","CITY","Tax_Rate","Pre-tax_rate","W/tax_rate","AllMeals","Breakfast","Lunch","Dinner","Incidentals",null,null,null,"Day Tot","Breakfast","Lunch","Dinner","Incidentals"]
[{"$f":"B6&\"  -- \"&C6","v":"    --  "},"  "," ",0,0,0,0,0,0,0,0,null,null,null,31,6,6,16,5]
[{"$f":"B7&\"  -- \"&C7","v":"Alameda  -- Alameda, City"},"Alameda","Alameda, City",0.1,124,{"$f":"+E7+E7*D7","v":136.4},61,{"$f":"VLOOKUP($G7,meals,2)","v":10},{"$f":"VLOOKUP($G7,meals,3)","v":15},{"$f":"VLOOKUP($G7,meals,4)","v":31},{"$f":"VLOOKUP($G7,meals,5)","v":5},null,null,null,35,7,7,18,5]
[{"$f":"B8&\"  -- \"&C8","v":"Alameda  -- Albany"},"Alameda","Albany",0.1,124,{"$f":"+E8+E8*D8","v":136.4},61,{"$f":"VLOOKUP($G8,meals,2)","v":10},{"$f":"VLOOKUP($G8,meals,3)","v":15},{"$f":"VLOOKUP($G8,meals,4)","v":31},{"$f":"VLOOKUP($G8,meals,5)","v":5},null,null,null,39,7,11,18,5]
["Alameda  -- Berkeley","Alameda","Berkeley",0.12,124,138.88,61,10,15,31,5,null,null,null,43,9,9,22,5]
["Alameda  -- Dublin","Alameda","Dublin",0.08,124,133.91999999999999,61,10,15,31,5,null,null,null,44,8,12,21,5]
{"$rows_left_out":633}
{"sheet":"Out of State","index":9,"n_rows":661,"n_cols":18,"rows_kept":661,"cut":false,"hidden":false,"merged":[[0,1,0,5]]}
[null,"Note: Out of State rates are not up-to-date. Please check rates at: http://www.gsa.gov/portal/category/100120"]
[]
[]
[]
[null,"State/City","STATE","CITY","Pre-tax_rate","AllMeals","Breakfast","Lunch","Dinner","Incidentals",null,null,null,"Day Tot","Breakfast","Lunch","Dinner","Incidentals"]
[null,"   --  "," "," ",0,0,0,0,0,0,null,null,null,31,6,6,16,5]
[null,"ALABAMA  -- Conus Rate","Alabama","CONUS",77,46,{"$f":"VLOOKUP($F7,$N$6:$R$17,2)","v":7},{"$f":"VLOOKUP($F7,$N$6:$R$17,3)","v":11},{"$f":"VLOOKUP($F7,$N$6:$R$17,4)","v":23},{"$f":"VLOOKUP($F7,$N$6:$R$17,5)","v":5},{"$f":"E7+F7","v":123},null,null,35,7,7,18,5]
[null,"Alabama - Baldwin (Gulf Shores) (October 1-May 31)","Alabama","Gulf Shores",100.02987,51,8,12,26,5,{"$f":"E8+F8","v":151.02987000000002},null,null,43,9,9,22,5]
[null,"Alabama - Baldwin (Gulf Shores) (June 1-July 31)","Alabama","Gulf Shores",117,51,8,12,26,5,168,null,null,39,7,11,18,5]
[null,"Alabama - Baldwin (Gulf Shores) (Aug 1-Sep 30)","Alabama","Gulf Shores",100,51,8,12,26,5,151,null,null,39,7,11,18,5]
{"$rows_left_out":652}
{"sheet":"Sheet1","index":10,"n_rows":632,"n_cols":10,"rows_kept":632,"cut":false,"hidden":false,"merged":[]}
["State","Destination","Location Defined (Counties unless otherwise defined)","Season Begin Date","Season End Date",null,null,"FY06 Final Lodging Rate","FY06 M&IE","Maximum Per Diem Rate"]
[null,"Standard CONUS Rate applies to all destinations not specifically listed",null,null,null,null,null,60,39,{"$f":"SUM(H2:I2)","v":99}]
["AL","Birmingham","Jefferson and Shelby",null,null,"ALABAMA",{"$f":"+C3&\" \"&MONTH(D3)&\"/\"&DAY(D3)&\"-\"&MONTH(E3)&\"/\"&DAY(E3)","v":"Jefferson and Shelby 1/0-1/0"},72,44,116]
["AL","Gulf Shores","Baldwin","2005-10-01","2006-02-28","ALABAMA","Baldwin 10/1-2/28",80,39,119]
["AL","Gulf Shores","Baldwin","2006-03-01","2006-08-31","ALABAMA","Baldwin 3/1-8/31",93,39,132]
["AL","Gulf Shores","Baldwin","2006-09-01","2006-09-30","ALABAMA","Baldwin 9/1-9/30",80,39,119]
["AL","Huntsville","Madison and Limestone",null,null,"ALABAMA","Madison and Limestone 1/0-1/0",66,44,110]
["AR","Hot Springs","Garland",null,null,"ARKANSAS","Garland 1/0-1/0",76,49,125]
["AR","Little Rock","Pulaski",null,null,"ARKANSAS","Pulaski 1/0-1/0",71,54,125]
["AZ","Grand Canyon/Flagstaff","Coconino (except the city limits of Sedona)",null,null,"ARIZONA","Coconino (except the city limits of Sedona) 1/0-1/0",68,44,112]
{"$rows_left_out":622}